Thu Oct 1 2020 08:27:09 UTC
Hide Search Description
68 bugs found.
ID Product Component Assignee Status Resolution Summary Changed
250017 Ports & Packages Individual Port(s) desktop New --- build_fs_violation in poudriere (with -t flag) while building some dependent ports of devel/gobject-introspection 08:26:36
249571 Ports & Packages Individual Port(s) ports-bugs New --- net-mgmt/bandwhich: Update to version 0.19.0 08:18:44
249898 Ports & Packages Individual Port(s) fernape In Progress --- sysutils/lnav: Update to 0.9.0 08:15:58
250016 Ports & Packages Individual Port(s) ports-bugs Open --- net/bwping: Update to 2.1 07:42:58
249991 Ports & Packages Individual Port(s) fernape In Progress --- x11-themes/matcha-gtk-themes: Update to 2020-09-28 07:30:17
250002 Ports & Packages Individual Port(s) ports-bugs Open --- devel/py-oci: update to 2.21.6 07:28:23
250005 Ports & Packages Individual Port(s) ports-bugs Open --- databases/cassandra3: Update to 3.11.8 07:21:10
250008 Ports & Packages Individual Port(s) ports-bugs Open --- net-mgmt/ocsinventory-server: update to 2.8 07:19:33
250020 Ports & Packages Individual Port(s) ports-bugs Open --- sysutils/ldap-account-manager: Update to 7.3 07:17:47
250021 Ports & Packages Individual Port(s) je3kmz Open --- dns/maradns: Update to 3.5.0016 07:16:26
250011 Ports & Packages Individual Port(s) x11 New --- graphics/libdrm: "MESA-LOADER: failed to retrieve device information" since 2.4.102 07:16:11
244439 Ports & Packages Individual Port(s) pkg New --- ports-mgmt/pkg 1.13.2 does not handle LOCALBASE split to different file systems right 06:45:36
249989 Ports & Packages Individual Port(s) glebius Closed FIXED mail/crm114: fix build with -fno-common 06:28:26
250009 Ports & Packages Individual Port(s) x11 New --- graphics/drm-fbsd12.0-kmod: sound unusable on DisplayPort after DPMS or screen OFF/ON. 06:13:13
250010 Ports & Packages Individual Port(s) ports-bugs Closed FIXED multimedia/shotcut: fails to build "spatialmedia/constants.h:38:12: fatal error: 'endian.h' file not found" 05:31:33
249904 Ports & Packages Individual Port(s) ports-bugs Open --- security/snort2pfcd: Update to 3.2 05:22:42
248712 Ports & Packages Individual Port(s) cs Open --- security/py-stem: Replace security/py-pycrypto with security/py-cryptography 04:14:00
250018 Ports & Packages Individual Port(s) koobs In Progress --- security/py-sequoia: Build failure due to incompatibility to python 2.7 04:00:30
249956 Ports & Packages Individual Port(s) meta Closed FIXED net/tigervnc-server: fails to build "ld: error: duplicate symbol: ddxInputThreadInit" 02:04:59
249927 Ports & Packages Individual Port(s) ports-bugs Open --- x11/mate: Applications fails to start: CRITICAL: polkit_authority_check_authorization: assertion 'POLKIT_IS_AUTHORITY (authority)' failed 21:35:53
244403 Ports & Packages Individual Port(s) pgsql Closed FIXED databases/postgresql11-server: Fix build with clang 10.0.0 21:07:15
233099 Ports & Packages Individual Port(s) pgsql Closed FIXED databases/postgresql96-client Configure complains about SSE2 32bit support on amd64 21:04:55
249473 Ports & Packages Individual Port(s) ports-bugs Closed FIXED www/tt-rss: Update to g20200919 (Fixes several security vulnerabilities) 20:33:11
249472 Ports & Packages Individual Port(s) ports-secteam Closed FIXED security/vuxml: Add recent tt-rss issues 20:30:09
249450 Ports & Packages Individual Port(s) bapt New --- devel/gvfs: Update to 1.46.0 20:03:12
250013 Ports & Packages Individual Port(s) vsevolod New --- mail/rspamd: Update to 2.6 19:56:31
249958 Ports & Packages Individual Port(s) rhurlin Closed FIXED www/librespeed: Update to 5.2.2 19:56:31
249295 Ports & Packages Individual Port(s) hselasky Closed FIXED devel/libmtdev: update to 1.1.6 19:50:37
249962 Ports & Packages Individual Port(s) hselasky Closed FIXED devel/libmtdev: Update to 1.1.6 and pass maintainership 19:50:28
249961 Ports & Packages Individual Port(s) hselasky Closed FIXED devel/libevdev: Update to latest snapshot (1.9.1 + FreeBSD fixes) and pass to x11@ 19:50:16
249963 Ports & Packages Individual Port(s) hselasky Closed FIXED devel/py-evdev: Update to 1.3.0 and pass maitainership to x11@ 19:49:44
250012 Ports & Packages Individual Port(s) bofh Open --- databases/postgresql-repmgr: fails to start if pid file does not exist 19:22:18
249946 Ports & Packages Individual Port(s) ports-bugs Open --- net/nncp: Update to 5.4.1 18:53:48
250001 Ports & Packages Individual Port(s) freqlabs In Progress --- sysutils/openzfs-kmod cc error - use of undeclared identifier 'FPU_KERN_NORMAL' 17:17:34
249312 Ports & Packages Individual Port(s) lwhsu In Progress --- security/modsecurity3: patch for cve 2020-15598 17:11:32
249877 Ports & Packages Individual Port(s) gnome New --- devel/appstream-glib: Update to 0.7.18 16:16:18
249945 Ports & Packages Individual Port(s) ports-bugs Open --- net/yggdrasil: Update to 0.3.15 15:34:20
249728 Ports & Packages Individual Port(s) multimedia Closed FIXED multimedia/py-gstreamer: depends on python 2.x 15:26:15
206663 Ports & Packages Individual Port(s) gnome New --- x11/gnome-shell: shell and desktop failed Wed 13:20
195394 Ports & Packages Individual Port(s) gnome Closed FIXED x11/gnome-terminal fails to start Wed 13:19
249932 Ports & Packages Individual Port(s) x11 New --- graphics/drm-fbsd12.0-kmod: panic on certain graphics operations Wed 12:51
249938 Ports & Packages Individual Port(s) mr Closed FIXED deskutils/nextcloudclient: fails to build in poudriere due to missing dependencies Wed 10:47
250007 Ports & Packages Individual Port(s) acm New --- openVAS outdated or end-of-life scan engine Wed 10:12
249326 Ports & Packages Individual Port(s) kib Closed FIXED emulators/virtualbox-ose-kmod panic in 13-CURRENT r365718 and in 12-STABLE r365830 Wed 10:09
248465 Ports & Packages Individual Port(s) yuri Closed DUPLICATE databases/cassandra3: Update to 3.11.7 Wed 09:48
242353 Ports & Packages Individual Port(s) meta Open --- sysutils/rubygem-bundler: Update to 2.1.4 Wed 09:39
249978 Ports & Packages Individual Port(s) ports-bugs Open --- sysutils/modules: Update to 4.2.2, switch to new upstream Wed 09:38
249949 Ports & Packages Individual Port(s) riggs Closed FIXED audio/libsndfile: Update to 1.0.30 Wed 09:31
249964 Ports & Packages Individual Port(s) olivier Open --- sysutils/lcdproc fix build with -fno-common Wed 09:16
250004 Ports & Packages Individual Port(s) nivit Open --- textproc/google-translate-cli: Update to 0.9.6.12 Wed 08:44
241985 Documentation Manual Pages bapt Closed FIXED ex(1)/vi(1)/view(1) man page mentions broken options and refers to invalid section 05:25:25
250006 Base System arm freebsd-arm New --- mmc0: Failed to set VCCQ for card at relative address 22964 - bananapi-m1 Wed 09:57
249981 Base System bhyve virtualization New --- bhyve man page cpu pinning description could be more helpful 21:02:55
250014 Base System bin bugs New --- usr.sbin/syslogd/syslogd.c: Forgotten changes for support RFC 5424 21:01:09
250015 Base System bin bugs New --- diff -purw fails with 'error: conflicting output format options.' 20:43:32
229995 Base System kern bugs Open --- [panic, regression] radeonkms "timed sleep before timers are working" 06:02:56
227869 Base System kern bugs Open --- Backlight brightness media keys are not working on Lenovo B570e (although backlight brightness can be controlled via intel_backlight) 03:09:30
249395 Base System kern jhb In Progress --- Regression in 12.stable/12.2-beta: sg driver not working for makemkv 18:10:41
241133 Base System kern markj In Progress --- page fault in ng_l2tp_seq_rack_timeout 17:58:35
210742 Base System kern bugs Closed Overcome By Eve intel Xeon E3-1200 v2/3rd Gen Core processor Graphics Controller and 3440x1440 resolution 17:04:00
249987 Base System kern bugs New --- Lenovo X120e touchpad failing 14:43:07
236105 Base System kern net New --- carp MASTER/MASTER status when adding or removing carp IP addresses Wed 13:19
248474 Base System misc net Open --- if_ipsec: NAT broken on IPsec/VTI 02:16:11
239519 Base System misc bugs New --- /usr/share/examples/ipfw/change_rules.sh uses not supported base system diff switch 20:57:19
233769 Base System misc markj In Progress --- Possible build race: ld: error: unable to find library -lgcc_s Wed 13:19
250019 Base System standards standards New --- /usr/src/stand/uboot/lib/glue.c 02:56:53
249960 Base System tests testing New --- Capsicum test OpenatTest.WithFlag and ForkedOpenatTest_WithFlagInCapabilityMode._ failed after (r366012, r366036] 21:07:28
249966 Base System usb usb New --- USB config SX lock 21:03:18
68 bugs found.

as