Tue May 21 2019 12:58:30 UTC
look ma; It's a bug!
Hide Search Description
62 bugs found.
ID Product Component Assignee Status Resolution Summary Changed
130067 Base System standards standards Open --- Wrong numeric limits in system headers? 2019-02-02
192839 Base System bin bugs New --- Duplicate entries in an mtree file cause nmtree to coredump 2018-02-20
196678 Ports & Packages Individual Port(s) x11 In Progress --- x11-servers/xorg-server: Update to 1.20.4 + make config/devd recognize /dev/input/eventX from multimedia/webcamd 2019-03-24
203776 Ports & Packages Individual Port(s) office New --- [patch] editors/libreoffice: Unbreak printing without CUPS 2018-03-17
205852 Ports & Packages Ports Framework portmgr New --- Be nicer about multiple sqlalchemy ports 2018-01-11
208580 Ports & Packages Ports Framework portmgr Open --- [EXP-RUN] ASLR check 2019-02-14
211875 Base System tests testing In Progress --- DTrace test failures on ^/head@r304091 2019-01-22
217010 Base System misc delphij Open --- FreeBSD-head-i386-build build is failing because xz ran out of memory 2018-08-12
217528 Base System tests dim Open --- lib/msun/ctrig_test fails with clang 4.0+ 2017-11-05
218198 Ports & Packages Individual Port(s) bapt Open --- devel/aarch64-binutils: update to 2.28 breaks buildworld with aarch64 2019-01-27
218310 Ports & Packages Individual Port(s) office New --- editors/libreoffice: uses wrong fonts 2018-09-03
218657 Base System standards standards New --- Usage of I (_Complex_I) from complex.h results in unexpected warnings with clang -pedantic 2019-04-15
223174 Ports & Packages Individual Port(s) lwhsu New --- devel/riscv64-gcc: doesn't have libgcov.a; doesn't work with --coverage 2017-11-06
226842 Ports & Packages Individual Port(s) office Open --- editors/libreoffice: installation fails on staging 2018-08-14
226964 Ports & Packages Individual Port(s) office New --- editors/libreoffice: 6.0.2_2 crashes at start with libi18npoollo.so: Undefined symbol 2019-02-07
227005 Services Testing & CI clusteradm In Progress --- Redirect tinderbox CNAME 2018-06-21
227044 Base System wireless wireless Open --- Add support for Intel 9260 and 5165 (iwm) wireless devices 2019-05-01
227351 Ports & Packages Individual Port(s) ports-bugs Open --- [NEW PORT] emulators/mesen: Cross-platform Nintendo Entertainment System (NES/Famicom) emulator 2019-02-13
227359 Ports & Packages Individual Port(s) lwhsu In Progress --- sysutils/phpfpm_exporter: Update to 0.4.1 2018-04-09
227844 Ports & Packages Individual Port(s) ports-bugs Open --- [NEW PORT] games/regoth, Gothic I and II engine reimplementation 2018-12-17
228487 Ports & Packages Individual Port(s) krion In Progress --- New port: emulators/yuzu, experimental Nintendo Switch emulator 2018-07-28
228606 Base System misc emaste Open --- makeroot.sh w/ -f fails with duplicate definition errors 2018-08-12
229656 Services Testing & CI lwhsu In Progress --- CI is way too spammy 2018-07-11
229708 Base System bin bugs New --- Don't require the program header for ELF files fit in the first page Sat 07:33
230140 Ports & Packages Individual Port(s) araujo In Progress --- textproc/py-sphinx: Update to 1.8.1 2018-11-08
230240 Base System bin bugs New --- import clang 7.0.0 (tracking PR) 2018-12-15
230501 Base System misc bugs New --- EFI loader fails with "panic: free: guard1 fail" when booting 2019-04-02
230857 Base System kern bz In Progress --- loading carp module panic i386 kernel (VIMAGE related) 2019-05-10
231211 Base System kern fs New --- [zfs] possible deadlock triggered by zfs test suite 2018-09-14
231212 Base System kern fs New --- `zfs destroy` a jail running buildworld causes "ranlib: fatal: Failed to open 'libXXX.a'" 2018-09-07
231240 Base System kern cpm Open --- net/ocserv: ocserv causing kernel panic in certain cases 2019-01-21
232792 Ports & Packages Individual Port(s) python Open --- Namespace pollution in all python ports 2019-04-24
233010 Ports & Packages Individual Port(s) ports-bugs Open --- x11/kitty: Cross-platform, fast, feature full, GPU based terminal emulator 2019-03-15
233121 Documentation Documentation doc New --- Possibly wrong instruction for merging in Committer's Guide 2018-11-11
233177 Services Code Review phabric-admin In Progress --- getting a curl error trying to create a phabricator review 2019-04-13
233433 Documentation Documentation doc Open --- Can't make freebsd handbook zh_TW property. 2018-12-03
233586 Base System tests testing New --- flip-flop test case: sys.kqueue.libkqueue.kqueue_test.main 2018-12-06
233587 Base System tests testing New --- flip-flop test case: usr.bin.procstat.procstat_test.command_line_arguments 2018-12-06
233588 Base System tests testing New --- flip-flop test case: usr.bin.procstat.procstat_test.environment 2018-12-06
233589 Base System tests testing New --- flip-flop test case: local.kyua.utils.signals.timer_test.infinitesimal 2018-11-28
233646 Base System tests testing In Progress --- Flakey test case: bin.sh.builtins.functional_test.kill1 2019-01-21
233649 Base System tests testing New --- Flakey test case: sys.kern.sysv_test.msg 2018-11-29
233735 Base System misc bugs New --- Possible build race: genoffset.o /usr/src/sys/sys/types.h: error: machine/endian.h: No such file or directory 2019-01-31
233769 Base System misc bugs New --- Possible build race: ld: error: unable to find library -lgcc_s 2019-03-26
233821 Base System tests testing New --- Flakey test case: usr.bin.procstat.procstat_test.file_descriptor 2018-12-06
235100 Base System bin bugs New --- Setting LANG=zh_TW.Big5 expends `/` to "-\---/" 2019-01-21
235356 Ports & Packages Individual Port(s) lwhsu Open --- devel/jenkins fails to start after upgrade if jenkins home dir is /usr/local/jenkins 2019-02-12
235597 Services Bug Tracker bugmeister New --- "Ports Framework" component is gone in bug creating page 2019-02-17
235872 Ports & Packages Individual Port(s) lwhsu In Progress --- lang/julia: Convert to metaport and add new port lang/julia11 2019-05-13
236864 Base System kern bugs New --- sys/netpfil/pf/ioctl/validation:addtables triggered a GPF panic 2019-04-01
237064 Base System bin bugs New --- Fix a memory leak in pw when invoked with -V or -R 2019-04-07
237077 Base System misc bugs New --- possible race in build: /usr/src/sys/amd64/linux/linux_support.s:38:2: error: expected relocatable expression 2019-04-08
237130 Base System tests jmg New --- sys.opencrypto.runtests.main fails on the i386 ^/stable/11 and ^/stable/12 Jenkins jobs when calling ioctl on /dev/crypto with EINVAL 2019-04-09
237403 Base System tests ngie In Progress --- Tests in sys/opencrypto should be converted to Python3 04:08:14
237418 Ports & Packages Individual Port(s) sbz Open --- net/py-dpkt: Update to 1.9.2 2019-04-20
237641 Base System tests markj New --- Flakey test case: common.misc.t_dtrace_contrib.tst_dynopt_d 2019-04-29
237652 Base System tests testing New --- tests.hotspare.hotspare_test.hotspare_snapshot_001_pos timeout since somewhere in (r346814, r 346845] 2019-04-29
237655 Base System kern kp New --- Non-deterministic panic when running pf tests in interface ioctl code (NULL passed to strncmp) 2019-04-29
237656 Base System kern kp Open --- "Freed UMA keg (rtentry) was not empty (18 items). Lost 1 pages of memory." seen when running sys/netipsec tests Sat 18:20
237657 Base System tests markj New --- sys.kern.pdeathsig.signal_delivered_ptrace timing out periodically on i386 2019-04-29
237982 Ports & Packages Individual Port(s) ports-bugs Open --- devel/powerpc64-gcc: Regular expression use is not suitable for targets with multiple hyphens Mon 14:33
238012 Base System kern bugs Open --- ipsec(4): Loading kernel module panic: vnet_ipcompstat_init 04:49:07
62 bugs found.

as