Bug 151997 - [patch] sysutils/fusefs-ntfs no build
Summary: [patch] sysutils/fusefs-ntfs no build
Status: Closed FIXED
Alias: None
Product: Ports & Packages
Classification: Unclassified
Component: Individual Port(s) (show other bugs)
Version: Latest
Hardware: Any Any
: Normal Affects Only Me
Assignee: freebsd-ports-bugs (Nobody)
URL:
Keywords:
Depends on:
Blocks:
 
Reported: 2010-11-06 23:00 UTC by Ivan Klymenko
Modified: 2010-11-18 11:40 UTC (History)
0 users

See Also:


Attachments
file.diff (554 bytes, patch)
2010-11-06 23:00 UTC, Ivan Klymenko
no flags Details | Diff

Note You need to log in before you can comment on or make changes to this bug.
Description Ivan Klymenko 2010-11-06 23:00:20 UTC
sysutils/fusefs-ntfs no build because it does not find header file: "glib.h: No such file or directory"

============>
..
/bin/sh /usr/local/bin/libtool --tag=CC   --mode=compile cc -DHAVE_CONFIG_H -I. -I..   -I/usr/local/include -I../include/ntfs-3g  -O2 -pipe -O3 -pipe -mtune=native -mmmx -msse -msse2 -msse3 -march=nocona -DUSE_LOCK -DUSE_UBLIO -fno-strict-aliasing -Wall -MT libntfs_3g_la-compat.lo -MD -MP -MF .deps/libntfs_3g_la-compat.Tpo -c -o libntfs_3g_la-compat.lo `test -f 'compat.c' || echo './'`compat.c
libtool: compile:  cc -DHAVE_CONFIG_H -I. -I.. -I/usr/local/include -I../include/ntfs-3g -O2 -pipe -O3 -pipe -mtune=native -mmmx -msse -msse2 -msse3 -march=nocona -DUSE_LOCK -DUSE_UBLIO -fno-strict-aliasing -Wall -MT libntfs_3g_la-compat.lo -MD -MP -MF .deps/libntfs_3g_la-compat.Tpo -c compat.c  -fPIC -DPIC -o .libs/libntfs_3g_la-compat.o
In file included from attrib.c:66:
/usr/local/include/efs.h:31:18: error: glib.h: No such file or directory
In file included from attrib.c:66:
/usr/local/include/efs.h:64: error: expected '=', ',', ';', 'asm' or '__attribute__' before '*' token
/usr/local/include/efs.h:71: error: expected specifier-qualifier-list before 'gchar'
/usr/local/include/efs.h:79: error: expected specifier-qualifier-list before 'guint32'
/usr/local/include/efs.h:87: error: expected specifier-qualifier-list before 'guint8'
/usr/local/include/efs.h:92: error: expected specifier-qualifier-list before 'gchar'
/usr/local/include/efs.h:101: error: expected declaration specifiers or '...' before 'gint'
/usr/local/include/efs.h:102: error: expected declaration specifiers or '...' before 'gint'
/usr/local/include/efs.h:102: error: expected declaration specifiers or '...' before 'gchar'
/usr/local/include/efs.h:103: error: expected declaration specifiers or '...' before 'gint'
/usr/local/include/efs.h:104: error: expected declaration specifiers or '...' before 'gint'
/usr/local/include/efs.h:104: error: expected declaration specifiers or '...' before 'EFSPassFunc'
/usr/local/include/efs.h:110: error: expected '=', ',', ';', 'asm' or '__attribute__' before '*' token
/usr/local/include/efs.h:113: error: expected declaration specifiers or '...' before 'gint'
/usr/local/include/efs.h:115: error: expected declaration specifiers or '...' before 'gint32'
/usr/local/include/efs.h:115: error: expected declaration specifiers or '...' before 'gint'
/usr/local/include/efs.h:116: error: expected declaration specifiers or '...' before 'guint32'
/usr/local/include/efs.h:117: error: expected declaration specifiers or '...' before 'guint32'
/usr/local/include/efs.h:118: error: expected declaration specifiers or '...' before 'gpointer'
/usr/local/include/efs.h:118: error: expected declaration specifiers or '...' before 'gint32'
/usr/local/include/efs.h:119: error: expected declaration specifiers or '...' before 'guint32'
/usr/local/include/efs.h:120: error: expected declaration specifiers or '...' before 'gpointer'
/usr/local/include/efs.h:120: error: expected declaration specifiers or '...' before 'gint32'
/usr/local/include/efs.h:121: error: expected declaration specifiers or '...' before 'guint32'
/usr/local/include/efs.h:126: error: expected declaration specifiers or '...' before 'gint'
/usr/local/include/efs.h:128: error: expected declaration specifiers or '...' before 'guint32'
/usr/local/include/efs.h:129: error: expected declaration specifiers or '...' before 'guint32'
/usr/local/include/efs.h:135: error: expected declaration specifiers or '...' before 'gint'
/usr/local/include/efs.h:135: error: expected declaration specifiers or '...' before 'gint'
/usr/local/include/efs.h:138: error: expected '=', ',', ';', 'asm' or '__attribute__' before 'efs_node_equal'
/usr/local/include/efs.h:139: error: expected declaration specifiers or '...' before 'guint32'
/usr/local/include/efs.h:140: error: expected declaration specifiers or '...' before 'guint32'
/usr/local/include/efs.h:142: error: expected declaration specifiers or '...' before 'gchar'
/usr/local/include/efs.h:143: error: expected declaration specifiers or '...' before 'gchar'
/usr/local/include/efs.h:144: error: expected declaration specifiers or '...' before 'gchar'
/usr/local/include/efs.h:144: error: expected declaration specifiers or '...' before 'guint32'
/usr/local/include/efs.h:145: error: expected declaration specifiers or '...' before 'guint32'
/usr/local/include/efs.h:145: error: expected declaration specifiers or '...' before 'gchar'
distcc[74072] ERROR: compile (null) on localhost failed
*** Error code 1
libtool: compile:  cc -DHAVE_CONFIG_H -I. -I.. -I/usr/local/include -I../include/ntfs-3g -O2 -pipe -O3 -pipe -mtune=native -mmmx -msse -msse2 -msse3 -march=nocona -DUSE_LOCK -DUSE_UBLIO -fno-strict-aliasing -Wall -MT libntfs_3g_la-collate.lo -MD -MP -MF .deps/libntfs_3g_la-collate.Tpo -c collate.c -o libntfs_3g_la-collate.o >/dev/null 2>&1
mv -f .deps/libntfs_3g_la-collate.Tpo .deps/libntfs_3g_la-collate.Plo
libtool: compile:  cc -DHAVE_CONFIG_H -I. -I.. -I/usr/local/include -I../include/ntfs-3g -O2 -pipe -O3 -pipe -mtune=native -mmmx -msse -msse2 -msse3 -march=nocona -DUSE_LOCK -DUSE_UBLIO -fno-strict-aliasing -Wall -MT libntfs_3g_la-compat.lo -MD -MP -MF .deps/libntfs_3g_la-compat.Tpo -c compat.c -o libntfs_3g_la-compat.o >/dev/null 2>&1
mv -f .deps/libntfs_3g_la-compat.Tpo .deps/libntfs_3g_la-compat.Plo
1 error
*** Error code 1
1 error
*** Error code 2
1 error
===> Compilation failed unexpectedly.
You have chosen to use multiple make jobs (parallelization) for all ports.
This port was not tested for this setting.  Please remove FORCE_MAKE_JOBS and
retry the build before reporting the failure to the maintainer.
*** Error code 1

Stop in /usr/ports/sysutils/fusefs-ntfs.
*** Error code 1

Stop in /usr/ports/sysutils/fusefs-ntfs.
============>

Fix: patch

Patch attached with submission follows:
Comment 1 dfilter service freebsd_committer 2010-11-18 11:33:53 UTC
arved       2010-11-18 11:33:49 UTC

  FreeBSD ports repository

  Modified files:
    sysutils/fusefs-ntfs Makefile 
  Log:
  Include the local header files before LOCALBASE/include, to avoid buildfailure
  if bonobo is installed
  
  PR:             151997
  
  Revision  Changes    Path
  1.38      +2 -1      ports/sysutils/fusefs-ntfs/Makefile
_______________________________________________
cvs-all@freebsd.org mailing list
http://lists.freebsd.org/mailman/listinfo/cvs-all
To unsubscribe, send any mail to "cvs-all-unsubscribe@freebsd.org"
Comment 2 Tilman Keskinoz freebsd_committer 2010-11-18 11:33:55 UTC
State Changed
From-To: open->closed

A fix was committed, thanks for reporting!