Bug 235346 - OPNsense make dvd, from github. on FreeBSD/XEN - base_unity-10110e.cpp or .sh
Summary: OPNsense make dvd, from github. on FreeBSD/XEN - base_unity-10110e.cpp or .sh
Status: New
Alias: None
Product: Ports & Packages
Classification: Unclassified
Component: Ports Framework (show other bugs)
Version: Latest
Hardware: amd64 Any
: --- Affects Only Me
Assignee: freebsd-standards mailing list
URL:
Keywords:
Depends on:
Blocks:
 
Reported: 2019-01-31 10:26 UTC by eric.vanborren
Modified: 2019-02-05 14:42 UTC (History)
1 user (show)

See Also:


Attachments
base_unity-10110e.sh + cpp (3.37 KB, text/plain)
2019-01-31 10:26 UTC, eric.vanborren
no flags Details
base_unity-10110e.sh (3.37 KB, text/plain)
2019-01-31 11:08 UTC, eric.vanborren
no flags Details

Note You need to log in before you can comment on or make changes to this bug.
Description eric.vanborren 2019-01-31 10:26:29 UTC
Created attachment 201555 [details]
base_unity-10110e.sh + cpp

root@houssay03:~ # uname -a
FreeBSD houssay03 11.2-RELEASE FreeBSD 11.2-RELEASE #0 r335510: Fri Jun 22 04:32:14 UTC 2018     root@releng2.nyi.freebsd.org:/usr/obj/usr/src/sys/GENERIC  amd64
root@houssay03:~ #

===============
[32/127] cd /usr/obj/usr/ports/net-mgmt/icinga2/work/icinga2-2.10.2/lib/base && /usr/obj/usr/ports/net-mgmt/icinga2/work/icinga2-2.10.2/Bin/Release/mkclass perfdatavalue.ti /usr/obj/usr/ports/net-mgmt/icinga2/work/icinga2-2.10.2/lib/base/perfdatavalue-ti.cpp /usr/obj/usr/ports/net-mgmt/icinga2/work/icinga2-2.10.2/lib/base/perfdatavalue-ti.hpp
[33/127] cd /usr/obj/usr/ports/net-mgmt/icinga2/work/icinga2-2.10.2/lib/base && /usr/obj/usr/ports/net-mgmt/icinga2/work/icinga2-2.10.2/Bin/Release/mkclass sysloglogger.ti /usr/obj/usr/ports/net-mgmt/icinga2/work/icinga2-2.10.2/lib/base/sysloglogger-ti.cpp /usr/obj/usr/ports/net-mgmt/icinga2/work/icinga2-2.10.2/lib/base/sysloglogger-ti.hpp
[34/127] /usr/bin/c++   -I/usr/local/include -I. -Ilib -Ithird-party/execvpe -Ithird-party/mmatch -Ithird-party/socketpair -O2 -pipe -DHARDENEDBSD -fPIE -fPIC -fstack-protector-all -isystem /usr/local/include -fno-strict-aliasing  -DHARDENEDBSD -fPIE -fPIC -isystem /usr/local/include -Qunused-arguments -fcolor-diagnostics -pthread -Winvalid-pch -std=c++0x -O2 -pipe -DHARDENEDBSD -fPIE -fPIC -fstack-protector-all -isystem /usr/local/include -fno-strict-aliasing  -DHARDENEDBSD -fPIE -fPIC -isystem /usr/local/include -MD -MT lib/base/CMakeFiles/base.dir/application-version.cpp.o -MF lib/base/CMakeFiles/base.dir/application-version.cpp.o.d -o lib/base/CMakeFiles/base.dir/application-version.cpp.o -c lib/base/application-version.cpp
[35/127] /usr/bin/c++   -I/usr/local/include -I. -Ilib -Ithird-party/execvpe -Ithird-party/mmatch -Ithird-party/socketpair -O2 -pipe -DHARDENEDBSD -fPIE -fPIC -fstack-protector-all -isystem /usr/local/include -fno-strict-aliasing  -DHARDENEDBSD -fPIE -fPIC -isystem /usr/local/include -Qunused-arguments -fcolor-diagnostics -pthread -Winvalid-pch -std=c++0x -O2 -pipe -DHARDENEDBSD -fPIE -fPIC -fstack-protector-all -isystem /usr/local/include -fno-strict-aliasing  -DHARDENEDBSD -fPIE -fPIC -isystem /usr/local/include -MD -MT lib/base/CMakeFiles/base.dir/base_unity.cpp.o -MF lib/base/CMakeFiles/base.dir/base_unity.cpp.o.d -o lib/base/CMakeFiles/base.dir/base_unity.cpp.o -c lib/base/base_unity.cpp
FAILED: lib/base/CMakeFiles/base.dir/base_unity.cpp.o
/usr/bin/c++   -I/usr/local/include -I. -Ilib -Ithird-party/execvpe -Ithird-party/mmatch -Ithird-party/socketpair -O2 -pipe -DHARDENEDBSD -fPIE -fPIC -fstack-protector-all -isystem /usr/local/include -fno-strict-aliasing  -DHARDENEDBSD -fPIE -fPIC -isystem /usr/local/include -Qunused-arguments -fcolor-diagnostics -pthread -Winvalid-pch -std=c++0x -O2 -pipe -DHARDENEDBSD -fPIE -fPIC -fstack-protector-all -isystem /usr/local/include -fno-strict-aliasing  -DHARDENEDBSD -fPIE -fPIC -isystem /usr/local/include -MD -MT lib/base/CMakeFiles/base.dir/base_unity.cpp.o -MF lib/base/CMakeFiles/base.dir/base_unity.cpp.o.d -o lib/base/CMakeFiles/base.dir/base_unity.cpp.o -c lib/base/base_unity.cpp
c++: error: unable to execute command: Killed
c++: error: clang frontend command failed due to signal (use -v to see invocation)
FreeBSD clang version 6.0.0 (tags/RELEASE_600/final 326565) (based on LLVM 6.0.0)
Target: x86_64-unknown-freebsd11.2
Thread model: posix
InstalledDir: /usr/bin
c++: note: diagnostic msg: PLEASE submit a bug report to https://bugs.freebsd.org/submit/ and include the crash backtrace, preprocessed source, and associated run script.
c++: note: diagnostic msg:
********************

PLEASE ATTACH THE FOLLOWING FILES TO THE BUG REPORT:
Preprocessed source(s) and associated run script(s) are located at:
c++: note: diagnostic msg: /tmp/base_unity-10110e.cpp
c++: note: diagnostic msg: /tmp/base_unity-10110e.sh
c++: note: diagnostic msg:

********************
ninja: build stopped: subcommand failed.
[20190130213216] ===> Compilation failed unexpectedly.
Try to set MAKE_JOBS_UNSAFE=yes and rebuild before reporting the failure to
the maintainer.
*** Error code 1

Stop.
make: stopped in /usr/ports/net-mgmt/icinga2
Creating repository in /usr/obj/usr/tools/config/19.1/OpenSSL:amd64/.pkg-new/: .......... done
Packing files for repository: .... done
>>> Running build step: clean
>>> Removing packages set
>>> Creating package mirror set for 19.1.r2_46-OpenSSL-amd64... done
-rw-r--r--  1 root  wheel   205M Jan 30 21:32 packages-19.1.r2_46-OpenSSL-amd64.tar
>>> WARNING: The build may have integrity issues!
>>> Skipped version 1.6.0,1 for devel/pkgconf
>>> ERROR: The build encountered fatal issues!
>>> Aborted version 2.10.2_2 for net-mgmt/icinga2
*** Error code 1

Stop.
make: stopped in /usr/tools

^C
root@houssay03:/var/log #
Comment 1 eric.vanborren 2019-01-31 11:08:26 UTC
Created attachment 201556 [details]
base_unity-10110e.sh

base_unity-10110e.sh