Bug 238423 - graphics/drm-legacy-kmod fails to build
Summary: graphics/drm-legacy-kmod fails to build
Status: Closed Overcome By Events
Alias: None
Product: Ports & Packages
Classification: Unclassified
Component: Individual Port(s) (show other bugs)
Version: Latest
Hardware: amd64 Any
: --- Affects Only Me
Assignee: Johannes M Dieterich
URL:
Keywords:
Depends on:
Blocks:
 
Reported: 2019-06-08 17:57 UTC by andy
Modified: 2019-07-05 04:12 UTC (History)
1 user (show)

See Also:
bugzilla: maintainer-feedback? (jmd)


Attachments

Note You need to log in before you can comment on or make changes to this bug.
Description andy 2019-06-08 17:57:23 UTC
FreeBSD FBSD_13 13.0-CURRENT FreeBSD 13.0-CURRENT #36 r348677: Tue Jun  4 21:43:00 EDT 2019     root@FBSD_13:/usr/obj/usr/src/amd64.amd64/sys/MYKERNEL  amd64


--- intel_iic.o ---
cc  -O2 -pipe -fno-strict-aliasing  -Werror -D_KERNEL -DKLD_MODULE -nostdinc   -I. -I/usr/src/sys -I/usr/src/sys/contrib/ck/include -fno-common  -fno-omit-frame-pointer -mno-omit-leaf-frame-pointer -fdebug-prefix-map=./machine=/usr/src/sys/amd64/include -fdebug-prefix-map=./x86=/usr/src/sys/x86/include     -MD  -MF.depend.intel_iic.o -MTintel_iic.o -mcmodel=kernel -mno-red-zone -mno-mmx -mno-sse -msoft-float  -fno-asynchronous-unwind-tables -ffreestanding -fwrapv -fstack-protector -Wall -Wredundant-decls -Wnested-externs -Wstrict-prototypes -Wmissing-prototypes -Wpointer-arith -Wcast-qual -Wundef -Wno-pointer-sign -D__printf__=__freebsd_kprintf__ -Wmissing-include-dirs -fdiagnostics-show-option -Wno-unknown-pragmas -Wno-error-tautological-compare -Wno-error-empty-body -Wno-error-parentheses-equality -Wno-error-unused-function -Wno-error-pointer-sign -Wno-error-shift-negative-value -Wno-address-of-packed-member  -mno-aes -mno-avx  -std=iso9899:1999 -I/usr/ports/graphics/drm-legacy-kmod/work/drm-legacy-12bd551/drm2/../src/ -c /usr/ports/graphics/drm-legacy-kmod/work/drm-legacy-12bd551/src/dev/drm2/i915/intel_iic.c -o intel_iic.o
/usr/ports/graphics/drm-legacy-kmod/work/drm-legacy-12bd551/src/dev/drm2/i915/intel_iic.c:570:2: error: implicit declaration of function 'iicbus_set_nostop' is invalid in C99 [-Werror,-Wimplicit-function-declaration]
        iicbus_set_nostop(idev, true);
        ^
/usr/ports/graphics/drm-legacy-kmod/work/drm-legacy-12bd551/src/dev/drm2/i915/intel_iic.c:570:2: error: this function declaration is not a prototype [-Werror,-Wstrict-prototypes]
2 errors generated.
*** [intel_iic.o] Error code 1

make[4]: stopped in /usr/ports/graphics/drm-legacy-kmod/work/drm-legacy-12bd551/drm2/i915kms
1 error

make[4]: stopped in /usr/ports/graphics/drm-legacy-kmod/work/drm-legacy-12bd551/drm2/i915kms
*** [all_subdir_drm2/i915kms] Error code 2

make[3]: stopped in /usr/ports/graphics/drm-legacy-kmod/work/drm-legacy-12bd551/drm2
1 error

make[3]: stopped in /usr/ports/graphics/drm-legacy-kmod/work/drm-legacy-12bd551/drm2
*** [all_subdir_drm2] Error code 2

make[2]: stopped in /usr/ports/graphics/drm-legacy-kmod/work/drm-legacy-12bd551
1 error

make[2]: stopped in /usr/ports/graphics/drm-legacy-kmod/work/drm-legacy-12bd551
===> Compilation failed unexpectedly.
Try to set MAKE_JOBS_UNSAFE=yes and rebuild before reporting the failure to
the maintainer.
*** Error code 1

Stop.
make[1]: stopped in /usr/ports/graphics/drm-legacy-kmod
*** Error code 1

Stop.
Comment 1 Graham Perrin 2019-06-21 15:41:41 UTC
Me too. 

https://s.put.re/9gk2R9SC.txt