Bug 246473 - devel/libunwind make fail
Summary: devel/libunwind make fail
Status: Closed FIXED
Alias: None
Product: Ports & Packages
Classification: Unclassified
Component: Individual Port(s) (show other bugs)
Version: Latest
Hardware: Any Any
: --- Affects Only Me
Assignee: Sunpoet Po-Chuan Hsieh
URL:
Keywords:
Depends on: 246390
Blocks:
  Show dependency treegraph
 
Reported: 2020-05-14 21:43 UTC by Igor Konov
Modified: 2020-05-17 18:16 UTC (History)
0 users

See Also:
bugzilla: maintainer-feedback? (sunpoet)


Attachments

Note You need to log in before you can comment on or make changes to this bug.
Description Igor Konov 2020-05-14 21:43:13 UTC
cc: error: linker command failed with exit code 1 (use -v to see invocation)
*** [Gperf-simple] Error code 1

make[10]: stopped in /var/ports/sharedfs/usr/ports/devel/libunwind/work/libunwind-1.2.1/tests
3 errors

make[10]: stopped in /var/ports/sharedfs/usr/ports/devel/libunwind/work/libunwind-1.2.1/tests
*** [all-recursive] Error code 1

make[9]: stopped in /var/ports/sharedfs/usr/ports/devel/libunwind/work/libunwind-1.2.1
1 error

make[9]: stopped in /var/ports/sharedfs/usr/ports/devel/libunwind/work/libunwind-1.2.1
===> Compilation failed unexpectedly.
Try to set MAKE_JOBS_UNSAFE=yes and rebuild before reporting the failure to
the maintainer.
*** Error code 1

Stop.
make[8]: stopped in /sharedfs/usr/ports/devel/libunwind
*** Error code 1
Comment 1 Sunpoet Po-Chuan Hsieh freebsd_committer 2020-05-17 18:16:56 UTC
libunwind 1.4.0 landed. Please update ports tree and try again. Feel free to reopen this PR if problem still exists. Thanks!