Bug 249478 - devel/binutils 2.33.1_3,1 Failed build: error: unsupported argument '-madd-bnd-prefix' to option 'Wa'
Summary: devel/binutils 2.33.1_3,1 Failed build: error: unsupported argument '-madd-bn...
Status: New
Alias: None
Product: Ports & Packages
Classification: Unclassified
Component: Individual Port(s) (show other bugs)
Version: Latest
Hardware: amd64 Any
: --- Affects Only Me
Assignee: freebsd-ports-bugs (Nobody)
URL:
Keywords:
Depends on:
Blocks:
 
Reported: 2020-09-20 09:48 UTC by Martin Filla
Modified: 2020-09-20 09:57 UTC (History)
0 users

See Also:


Attachments

Note You need to log in before you can comment on or make changes to this bug.
Description Martin Filla 2020-09-20 09:48:17 UTC
Hi,
i have again issues in binutils.

c++: warning: optimization flag '-fmerge-constants' is not supported [-Wignored-optimization-argument]
c++: error: unsupported argument '-madd-bnd-prefix' to option 'Wa,'
c++: warning: optimization flag '-fmerge-constants' is not supported [-Wignored-optimization-argument]
gmake[6]: *** [Makefile:9488: exception_x86_64_bnd_1.o] Error 1
gmake[6]: *** Waiting for unfinished jobs....
c++: error: unsupported argument '-madd-bnd-prefix' to option 'Wa,'
c++: warning: optimization flag '-fmerge-constants' is not supported [-Wignored-optimization-argument]
gmake[6]: *** [Makefile:9490: exception_x86_64_bnd_2.o] Error 1
mv -f .deps/incr_comdat_test_2_v3.Tpo .deps/incr_comdat_test_2_v3.Po
mv -f .deps/many_sections_test.Tpo .deps/many_sections_test.Po
gmake[6]: Leaving directory '/usr/ports/devel/binutils/work-native/binutils-2.33.1/gold/testsuite'
gmake[5]: *** [Makefile:7729: check-am] Error 2
gmake[5]: Leaving directory '/usr/ports/devel/binutils/work-native/binutils-2.33.1/gold/testsuite'
gmake[4]: *** [Makefile:7733: check] Error 2
gmake[4]: Leaving directory '/usr/ports/devel/binutils/work-native/binutils-2.33.1/gold/testsuite'
gmake[3]: *** [Makefile:1156: check-recursive] Error 1
gmake[3]: Leaving directory '/usr/ports/devel/binutils/work-native/binutils-2.33.1/gold'
gmake[2]: *** [Makefile:6135: check-gold] Error 2
gmake[2]: Leaving directory '/usr/ports/devel/binutils/work-native/binutils-2.33.1'
gmake[1]: *** [Makefile:2205: do-check] Error 2
gmake[1]: Leaving directory '/usr/ports/devel/binutils/work-native/binutils-2.33.1'
*** [do-test] Error code 1
Comment 1 Martin Filla 2020-09-20 09:53:58 UTC
Here is log from compilation 
https://gist.github.com/Martinfx/993cb78b7a6af698fd0ae8751cfda573
Comment 2 Martin Filla 2020-09-20 09:57:46 UTC
Here is part 2 from compilation.
https://gist.github.com/Martinfx/8f18f7dfed6131636f0357f9acc2418d