Thu Oct 28 2021 06:16:15 UTC
Hide Search Description
84 bugs found.
ID Product Component Assignee Status Resolution Summary Changed
223065 Services FTP/WWW Sites & Mi philip In Progress --- INDEX file truncated from time to time 02:21:04
259498 Ports & Packages Individual Port(s) x11 New --- x11/nvidia-{settings,xconfig}: Update to 470.82.00 04:57:59
259497 Ports & Packages Individual Port(s) x11 New --- x11/linux-nvidia-libs: Update to 470.82.00 04:54:09
259496 Ports & Packages Individual Port(s) danfe New --- x11/nvidia-driver: Update to 470.82.00 04:57:59
259495 Ports & Packages Individual Port(s) mat Open --- sysutils/tmux: Fails to configure with UTF8PROC=ON: configure: error: "utf8proc not found" (libutf8proc is installed) 03:50:18
259493 Ports & Packages Individual Port(s) bsam New --- devel/pycharm-ce: update to 2021.2.3 20:25:39
259492 Ports & Packages Individual Port(s) ports-bugs New --- archivers/py-borgbackup: Update to 1.1.17 20:25:13
259491 Ports & Packages Individual Port(s) ruby New --- devel/ruby-gems: it should be updated to 3.1.4 20:11:37
259490 Ports & Packages Individual Port(s) office Open --- editors/libreoffice: Fails to link: StaticLibrary/libcodemaker_cpp.a] Error 1 22:01:09
259489 Ports & Packages Individual Port(s) bhughes Open --- www/node: Fails to package: include/node/openssl/rand_drbg.h:No such file or directory 01:40:00
259488 Ports & Packages Individual Port(s) gnome Open --- deskutils/gucharmap: Fails to build: ModuleNotFoundError: No module named 'libxml2' 21:27:02
259487 Ports & Packages Individual Port(s) timur Open --- net/samba412: Fails to configure: ERROR: Python module pytdb of version 1.4.3 not found 21:27:29
259486 Ports & Packages Individual Port(s) portmgr New --- [exp-run] Update cmake to 3.21.4 18:12:19
259485 Ports & Packages Individual Port(s) chromium New --- Cannot build www/chromium: fails on ffmpeg 15:26:20
259484 Ports & Packages Individual Port(s) meta In Progress --- devel/gocritic: update to 0.6.1 06:13:47
259483 Ports & Packages Individual Port(s) yuri Closed FIXED multimedia/assimp: fix build on 32 bit platforms 14:53:15
259482 Ports & Packages Individual Port(s) ports-bugs New --- mail/alpine: update distinfo maildir patch 15:16:16
259481 Ports & Packages Individual Port(s) ports-bugs Closed DUPLICATE mail/alpine: update distinfo maildir patch 15:14:24
259480 Ports & Packages Individual Port(s) ports-bugs Closed DUPLICATE multimedia/tautulli: Update to 2.7.7 Wed 10:29
259479 Ports & Packages Individual Port(s) ports-bugs New --- multimedia/tautulli: Update to 2.7.7 Wed 10:29
259478 Ports & Packages Individual Port(s) ports-bugs New --- devel/kiwix-lib: fix build on armv6/armv7 20:03:57
259477 Ports & Packages Individual Port(s) pizzamig New --- www/yarn-node14: Account for NODE16 Wed 08:45
259476 Ports & Packages Individual Port(s) pizzamig New --- www/yarn: Add a NODE16 option 05:08:02
259475 Ports & Packages Individual Port(s) ports-bugs New --- www/yarn-node16: Add new slave port 04:24:13
259471 Ports & Packages Individual Port(s) desktop Closed FIXED graphics/librsvg2-rust gnome2 patch fails to fetch 01:19:52
259469 Ports & Packages Individual Port(s) swills Closed FIXED devel/ncurses: Fails to fetch 16:12:58
259468 Ports & Packages Individual Port(s) glewis Open --- java/javavmwrapper: Add a java_home command 15:46:11
259456 Ports & Packages Individual Port(s) lwhsu Open --- www/mitmproxy: 7.0.2 fails to run: pkg_resources.DistributionNotFound: The 'zstandard<0.16,>=0.11' distribution was not found 14:48:49
259455 Ports & Packages Individual Port(s) x11 New --- graphics/drm-devel-kmod: loading i915kms from rc.conf cause system freeze 00:32:25
259454 Ports & Packages Individual Port(s) bhughes Open --- www/node: Fails to link: ld: error: undefined symbol: __atomic_is_lock_free 16:17:36
259452 Ports & Packages Individual Port(s) koobs Closed FIXED sysutils/py-diffoscope: Update to 188 14:12:14
259417 Ports & Packages Individual Port(s) ports-bugs New --- [NEW PORT] devel/scala-cli: Scala cli tool to build/package/compile/run Scala code 17:25:46
259410 Ports & Packages Individual Port(s) x11 New --- x11-servers/xorg-server does not have dependency for x11-drivers/xf86-input-evdev 00:33:25
259402 Ports & Packages Individual Port(s) x11 New --- x11-servers/xorg-server: stopping X makes system unresponsive 00:35:53
259377 Ports & Packages Individual Port(s) bhughes Open --- www/node: Fails to package with BUNDLED_SSL=ON: pkg-static: Unable to access file ... node/openssl/rand_drbg.h:No such file or directory 00:25:21
259372 Ports & Packages Individual Port(s) meta Closed FIXED devel/universal-ctags: Update to p5.9.20211017.0 05:40:52
259359 Ports & Packages Individual Port(s) bsam New --- update java/intellij to 2021.2.3 21:24:48
259358 Ports & Packages Individual Port(s) leres New --- devel/xtensa-esp32-elf: fix build on powerpc64* 17:37:36
259312 Ports & Packages Individual Port(s) ports-bugs New --- www/osrm-backend: Update to 5.26.0 04:52:53
259307 Ports & Packages Individual Port(s) ports-bugs New --- [NEW PORT] devel/py-circuitbreaker: Python Circuit Breaker pattern implementation 05:59:45
259297 Ports & Packages Individual Port(s) ports-bugs Closed FIXED security/py-fail2ban: Add upstream patch to fix possible RCE vulnerability 16:09:21
259296 Ports & Packages Individual Port(s) yasu Closed FIXED databases/redis_exporter: update to 1.28.0 16:14:29
259291 Ports & Packages Individual Port(s) ports-bugs Closed FIXED net-im/purple-hangouts: add the patch preventing the 429 HTTP-errors 20:18:04
259233 Ports & Packages Individual Port(s) ports-bugs New --- devel/coursier: account for coursier changes and update to 2.0.16 18:03:01
259211 Ports & Packages Individual Port(s) gerald Closed FIXED emulators/wine-devel: explicitly point Vulkan loader at 32-bit Mesa libs Wed 10:33
259196 Ports & Packages Individual Port(s) ports-bugs Open --- net-p2p/prowlarr: Indexer manager/proxy running under dotNET Wed 10:24
259118 Ports & Packages Individual Port(s) uboot Closed FIXED sysutils/u-boot-tools: fix build on non-arm non-x86 17:14:32
259006 Ports & Packages Individual Port(s) yasu Closed FIXED net-mgmt/sdig: fix build with -fno-common 16:13:29
258999 Ports & Packages Individual Port(s) fernape In Progress --- comms/spandsp: Update to 3.0.0 Wed 08:34
258978 Ports & Packages Individual Port(s) yasu Closed FIXED databases/mongodb50: update to 5.0.3 Wed 08:37
258962 Ports & Packages Individual Port(s) yasu Closed FIXED www/grafana8: Update to 8.1.6 (Fixes critical vulnerability) Wed 09:11
258898 Ports & Packages Individual Port(s) tijl Closed FIXED security/sssd: failure to package 19:32:19
258892 Ports & Packages Individual Port(s) swills New --- www/mattermost-webapp www/mattermost-server: Update to 6.0.2 17:57:09
258809 Ports & Packages Individual Port(s) yasu In Progress --- misc/pdmenu: update to 1.3.6 and unbreak with -fno-common 16:12:04
258794 Ports & Packages Individual Port(s) office New --- devel/icu: update to 70.1 01:02:30
258651 Ports & Packages Individual Port(s) yasu Closed FIXED [NEW] mail/postfixadmin33: PHP web-based management tool for Postfix virtual domains and users Wed 08:39
258650 Ports & Packages Individual Port(s) yasu Closed FIXED mail/postfixadmin: Update to 3.4.dev.20211018, adds php:flavors support, adds -lite slave Wed 08:50
258573 Ports & Packages Individual Port(s) chromium New --- www/chromium Could not install package: 'FAILED_TO_COPY_EXTENSION_FILE_TO_TEMP_DIRECTORY' 18:54:30
258199 Ports & Packages Individual Port(s) yasu In Progress --- [NEW PORT] devel/py-clang: Python bindings for libclang 00:32:55
258108 Ports & Packages Individual Port(s) portmgr New --- [exp-run] devel/ruby-gems: Update to 3.2.29 (Fixes for Ruby 3.0) 15:30:44
257708 Ports & Packages Individual Port(s) yasu Closed FIXED devel/stlink: Fails to build on 32-bit architectures: error: implicit conversion loses integer precision 16:45:52
257449 Ports & Packages Individual Port(s) ports-bugs Open --- lang/pocl: Update to 1.8 Wed 07:47
257333 Ports & Packages Individual Port(s) ports-bugs Open --- [NEW PORT] devel/py-async-exit-stack: AsyncExitStack backport for Python 3.5+ Wed 12:14
257332 Ports & Packages Individual Port(s) ports-bugs Open --- [NEW PORT] devel/py-aiocontextvars: Asyncio support for PEP-567 contextvars backport Wed 12:14
257131 Ports & Packages Individual Port(s) yasu In Progress --- [NEW PORT] devel/py-cadquery-pywrap: C++ binding generator for Python 00:33:47
256924 Ports & Packages Individual Port(s) yasu In Progress --- [NEW PORT]: devel/py-logzero - Robust and effective logging for Python 01:29:42
256624 Ports & Packages Individual Port(s) koobs Open --- devel/py-pytest: Update to 6.2.5 22:40:45
256454 Ports & Packages Individual Port(s) gnome Open --- x11/gdm: No users shown in login screen, and unable to unlock once locked 12:57:33
255647 Ports & Packages Individual Port(s) yasu Closed FIXED mail/postfix-current mail/postfix-current-sasl: Add FLAVORS: ldap_sasl sasl 00:11:52
255641 Ports & Packages Individual Port(s) yasu Closed FIXED mail/postfix mail/postfix-ldap-sasl mail/postfix-sasl: Add FLAVORS: ldap_sasl sasl 00:11:30
252536 Ports & Packages Individual Port(s) thierry Closed Overcome By Eve net/mpich: Build fails on mpl/src/gpu/mpl_gpu_ze.c 00:08:46
246106 Ports & Packages Individual Port(s) office Open --- devel/boost-all: Update to 1.76.0 23:26:22
221185 Ports & Packages Individual Port(s) kevans In Progress --- emulators/qemu-user-static: fails to run lang/rust Wed 11:38
259494 Documentation Documentation doc New --- FreeBSD Handbook glossary detached from the Handbook 01:21:59
259457 Base System kern bugs Closed Not A Bug kernel locks up while booting installer 14:03:02
259441 Base System kern bugs New --- System not booting with "KDB: debugger backends: ddb" 17:46:37
259380 Base System bin bugs Open --- linux(4): linux_recvfrom(2) fails: linux_recvfrom -1 errno -22 Invalid argument 16:00:07
259374 Base System kern bugs Open --- Linux(4) getifaddrs() results in Address family not supported by protocol getifaddrs() (EAFNOSUPPORT) 14:15:12
259218 Base System kern bugs New --- Fatal trap 12: page fault while in kernel mode 00:36:53
259069 Base System bin toolchain Open --- ldd -f format not applied to libraries 00:36:52
258208 Base System bin fs Open --- [zfs] locks up when using rollback or destroy on both 13.0-RELEASE & sysutils/openzfs port 21:01:12
256465 Base System bin eugen Closed FIXED [syslogd] [regression] Lost ability to accept and write some remote logs Wed 09:00
255073 Base System bin bugs New --- boot (UEFI): loader: copy_staging: no progress beyond EFI framebuffer information 00:26:26
248324 Base System kern net New --- qlxge: stability issues (unusable) with QLogic QLE8142 NIC 14:33:44
84 bugs found.

as